pygame 2.5.2 (SDL 2.30.4, Python 3.12.2)
Hello from the pygame community. https://www.pygame.org/contribute.html
======================================================================
FAIL: test_antialiase (__main__.FtVisualTests.test_antialiase)
----------------------------------------------------------------------
Traceback (most recent call last):
  File "/usr/lib64/python3/site-packages/pygame/tests/font_test.py", line 735, in test_antialiase
    self.assertTrue(self.query(antialiase=True))
AssertionError: False is not true

======================================================================
FAIL: test_bold (__main__.FtVisualTests.test_bold)
----------------------------------------------------------------------
Traceback (most recent call last):
  File "/usr/lib64/python3/site-packages/pygame/tests/font_test.py", line 722, in test_bold
    self.assertTrue(self.query(bold=True))
AssertionError: False is not true

======================================================================
FAIL: test_bold_antialiase (__main__.FtVisualTests.test_bold_antialiase)
----------------------------------------------------------------------
Traceback (most recent call last):
  File "/usr/lib64/python3/site-packages/pygame/tests/font_test.py", line 738, in test_bold_antialiase
    self.assertTrue(self.query(bold=True, antialiase=True))
AssertionError: False is not true

======================================================================
FAIL: test_italic (__main__.FtVisualTests.test_italic)
----------------------------------------------------------------------
Traceback (most recent call last):
  File "/usr/lib64/python3/site-packages/pygame/tests/font_test.py", line 725, in test_italic
    self.assertTrue(self.query(italic=True))
AssertionError: False is not true

======================================================================
FAIL: test_italic_underline (__main__.FtVisualTests.test_italic_underline)
----------------------------------------------------------------------
Traceback (most recent call last):
  File "/usr/lib64/python3/site-packages/pygame/tests/font_test.py", line 741, in test_italic_underline
    self.assertTrue(self.query(italic=True, underline=True))
AssertionError: False is not true

======================================================================
FAIL: test_underline (__main__.FtVisualTests.test_underline)
----------------------------------------------------------------------
Traceback (most recent call last):
  File "/usr/lib64/python3/site-packages/pygame/tests/font_test.py", line 728, in test_underline
    self.assertTrue(self.query(underline=True))
AssertionError: False is not true

----------------------------------------------------------------------
Ran 56 tests in 28.930s

FAILED (failures=6)
