pygame 2.5.2 (SDL 2.30.4, Python 3.12.2)
Hello from the pygame community. https://www.pygame.org/contribute.html
.error: XDG_RUNTIME_DIR is invalid or not set in the environment.
.error: XDG_RUNTIME_DIR is invalid or not set in the environment.
.error: XDG_RUNTIME_DIR is invalid or not set in the environment.
.FFerror: XDG_RUNTIME_DIR is invalid or not set in the environment.
.error: XDG_RUNTIME_DIR is invalid or not set in the environment.
...error: XDG_RUNTIME_DIR is invalid or not set in the environment.
..error: XDG_RUNTIME_DIR is invalid or not set in the environment.
....error: XDG_RUNTIME_DIR is invalid or not set in the environment.
.error: XDG_RUNTIME_DIR is invalid or not set in the environment.
...error: XDG_RUNTIME_DIR is invalid or not set in the environment.
......error: XDG_RUNTIME_DIR is invalid or not set in the environment.
...............................error: XDG_RUNTIME_DIR is invalid or not set in the environment.
...........error: XDG_RUNTIME_DIR is invalid or not set in the environment.
...error: XDG_RUNTIME_DIR is invalid or not set in the environment.
......error: XDG_RUNTIME_DIR is invalid or not set in the environment.
............error: XDG_RUNTIME_DIR is invalid or not set in the environment.
.....serror: XDG_RUNTIME_DIR is invalid or not set in the environment.
..error: XDG_RUNTIME_DIR is invalid or not set in the environment.
.error: XDG_RUNTIME_DIR is invalid or not set in the environment.
...s......error: XDG_RUNTIME_DIR is invalid or not set in the environment.
.......error: XDG_RUNTIME_DIR is invalid or not set in the environment.
.error: XDG_RUNTIME_DIR is invalid or not set in the environment.
....error: XDG_RUNTIME_DIR is invalid or not set in the environment.
..........
======================================================================
FAIL: test_convert_alpha_init (__main__.GeneralSurfaceTests.test_convert_alpha_init)
Ensure initialization exceptions are raised
----------------------------------------------------------------------
pygame.error: Parameter 'surface' is invalid

During handling of the above exception, another exception occurred:

Traceback (most recent call last):
  File "/usr/lib64/python3/site-packages/pygame/tests/./surface_test.py", line 1131, in test_convert_alpha_init
    self.assertRaisesRegex(pygame.error, "No video mode", surf.convert_alpha)
AssertionError: "No video mode" does not match "Parameter 'surface' is invalid"

======================================================================
FAIL: test_convert_init (__main__.GeneralSurfaceTests.test_convert_init)
Ensure initialization exceptions are raised
----------------------------------------------------------------------
pygame.error: Parameter 'surface' is invalid

During handling of the above exception, another exception occurred:

Traceback (most recent call last):
  File "/usr/lib64/python3/site-packages/pygame/tests/./surface_test.py", line 1111, in test_convert_init
    self.assertRaisesRegex(pygame.error, "No video mode", surf.convert)
AssertionError: "No video mode" does not match "Parameter 'surface' is invalid"

----------------------------------------------------------------------
Ran 130 tests in 10.559s

FAILED (failures=2, skipped=2)
