Click on lines in the table to see the details about each problem.
| Test Name | Severity | Resolution |
| comp/require.t 20 |
failed |
|
|
| io/layers.t 56 |
failed |
|
|
| op/attrs.t 73 |
failed |
|
|
| op/sort.t 163 |
failed |
|
|
| op/sprintf.t 166 |
failed |
|
|
| op/sprintf2.t 167 |
failed |
|
|
| uni/chomp.t 195 |
failed |
|
Message from the test:
FAILED tests 3-4, 11-12, 19-20, 27-28, 71-72, 79-80, 87-88, 95-96, 173-174, 181-182, 189-190, 197-198, 311-312, 319-320, 327-328, 335-336 Failed 32/414 tests, 92.27% okay
Open the journal:
/var/opt/lsb/test/manager/results/x86-comp-79a047.localdomain-2010-08-26-17h-35m-16s/results/perl.journal:1377/var/opt/lsb/test/manager/results/x86-comp-79a047.localdomain-2010-08-26-17h-35m-16s/results/perl.journal:1377
|
| uni/class.t 196 |
failed |
|
|
| uni/fold.t 197 |
failed |
|
|
| uni/tr_7jis.t 201 |
failed |
|
|
| uni/tr_eucjp.t 202 |
failed |
|
|
| uni/tr_sjis.t 203 |
failed |
|
|
| ../lib/CGI/t/pretty.t 221 |
failed |
|
|
| ../lib/CGI/t/util.t 223 |
failed |
|
|
| ../lib/CGI/t/function.t 232 |
failed |
|
|
| ../lib/Test/Simple/t/tbt_06errormess.t 237 |
failed |
|
|
| ../lib/Test/Simple/t/fail-more.t 238 |
failed |
|
|
| ../lib/Test/Simple/t/missing.t 240 |
failed |
|
|
| ../lib/Test/Simple/t/is_deeply_fail.t 247 |
failed |
|
Message from the test:
FAILED tests 3, 6, 9, 12, 15, 18, 21, 24, 27, 30, 34, 49, 52, 55, 58, 61, 64, 67, 70, 73 Failed 20/73 tests, 72.60% okay
Open the journal:
/var/opt/lsb/test/manager/results/x86-comp-79a047.localdomain-2010-08-26-17h-35m-16s/results/perl.journal:1753/var/opt/lsb/test/manager/results/x86-comp-79a047.localdomain-2010-08-26-17h-35m-16s/results/perl.journal:1753
|
| ../lib/Test/Simple/t/fail_one.t 248 |
failed |
|
|
| ../lib/Test/Simple/t/fail-like.t 250 |
failed |
|
|
| ../lib/Test/Simple/t/plan_bad.t 252 |
failed |
|
|
| ../lib/Test/Simple/t/plan.t 258 |
failed |
|
|
| ../lib/Test/Simple/t/undef.t 261 |
failed |
|
|
| ../lib/Test/Simple/t/harness_active.t 263 |
failed |
|
|
| ../lib/Test/Simple/t/extra.t 266 |
failed |
|
|
| ../lib/Test/Simple/t/overload.t 267 |
failed |
|
|
| ../lib/Test/Simple/t/fail.t 271 |
failed |
|
|
| ../lib/Test/Simple/t/exit.t 273 |
failed |
|
|
| ../lib/Test/Simple/t/skipall.t 281 |
failed |
|
|
| ../lib/Test/Simple/t/tbt_07args.t 282 |
failed |
|
|
| ../lib/Test/Simple/t/reset.t 284 |
failed |
|
|
| ../lib/Test/Simple/t/is_fh.t 288 |
failed |
|
|
| ../lib/Test/Simple/t/extra_one.t 291 |
failed |
|
|
| ../lib/Test/Simple/t/no_plan.t 292 |
failed |
|
|
| ../lib/bignum/t/bigint.t 322 |
failed |
|
|
| ../lib/File/Spec/t/Spec.t 342 |
failed |
|
|
| ../lib/Math/Complex.t 355 |
failed |
|
|
| ../lib/Math/BigInt/t/bigfltpm.t 360 |
failed |
|
|
| ../lib/Math/BigInt/t/use_lib3.t 363 |
failed |
|
|
| ../lib/Math/BigInt/t/use_lib2.t 364 |
failed |
|
|
| ../lib/Math/BigInt/t/sub_mbi.t 365 |
failed |
|
|
| ../lib/Math/BigInt/t/with_sub.t 368 |
failed |
|
|
| ../lib/Math/BigInt/t/sub_mbf.t 370 |
failed |
|
|
| ../lib/Math/BigInt/t/use_lib1.t 371 |
failed |
|
|
| ../lib/Math/BigInt/t/calling.t 376 |
failed |
|
|
| ../lib/Math/BigInt/t/bare_mbi.t 377 |
failed |
|
|
| ../lib/Math/BigInt/t/upgrade.t 379 |
failed |
|
|
| ../lib/Math/BigInt/t/sub_mif.t 383 |
failed |
|
|
| ../lib/Math/BigInt/t/use_mbfw.t 389 |
failed |
|
|
| ../lib/Math/BigInt/t/mbimbf.t 392 |
failed |
|
|
| ../lib/Math/BigInt/t/bigintpm.t 393 |
failed |
|
|
| ../lib/Math/BigInt/t/lib_load.t 395 |
failed |
|
|
| ../lib/Math/BigInt/t/bare_mif.t 396 |
failed |
|
|
| ../lib/Math/BigInt/t/mbf_ali.t 397 |
failed |
|
|
| ../lib/Math/BigInt/t/bare_mbf.t 398 |
failed |
|
|
| ../lib/Math/Trig.t 399 |
failed |
|
|
| ../lib/Math/BigRat/t/bigrat.t 404 |
failed |
|
|
| ../lib/Tie/File/t/23_rv_ac_splice.t 412 |
unreported |
No result |
|
| ../lib/Tie/File/t/42_offset.t 413 |
failed |
|
|
| ../lib/Tie/File/t/14_lock.t 414 |
unreported |
No result |
|
| ../lib/Tie/File/t/02_fetchsize.t 415 |
unreported |
No result |
|
| ../lib/Tie/File/t/20_cache_full.t 416 |
unreported |
No result |
|
| ../lib/Tie/File/t/19_cache.t 417 |
unreported |
No result |
|
| ../lib/Tie/File/t/08_ro.t 418 |
unreported |
No result |
|
| ../lib/Tie/File/t/24_cache_loop.t 419 |
unreported |
No result |
|
| ../lib/Tie/File/t/09_gen_rs.t 420 |
unreported |
No result |
|
| ../lib/Tie/File/t/28_mtwrite.t 421 |
unreported |
No result |
|
| ../lib/Tie/File/t/26_twrite.t 422 |
unreported |
No result |
|
| ../lib/Tie/File/t/06_fixrec.t 423 |
unreported |
No result |
|
| ../lib/Tie/File/t/17_misc_meth.t 424 |
unreported |
No result |
|
| ../lib/Tie/File/t/22_autochomp.t 425 |
unreported |
No result |
|
| ../lib/Tie/File/t/32_defer_misc.t 426 |
unreported |
No result |
|
| ../lib/Tie/File/t/04_splice.t 427 |
unreported |
No result |
|
| ../lib/Tie/File/t/11_rv_splice_rs.t 428 |
unreported |
No result |
|
| ../lib/Tie/File/t/07_rv_splice.t 429 |
unreported |
No result |
|
| ../lib/Tie/File/t/16_handle.t 430 |
unreported |
No result |
|
| ../lib/Tie/File/t/40_abs_cache.t 431 |
unreported |
No result |
|
| ../lib/Tie/File/t/18_rs_fixrec.t 432 |
unreported |
No result |
|
| ../lib/Tie/File/t/27_iwrite.t 433 |
unreported |
No result |
|
| ../lib/Tie/File/t/25_gen_nocache.t 434 |
unreported |
No result |
|
| ../lib/Tie/File/t/12_longfetch_rs.t 435 |
unreported |
No result |
|
| ../lib/Tie/File/t/31_autodefer.t 436 |
unreported |
No result |
|
| ../lib/Tie/File/t/29_downcopy.t 437 |
unreported |
No result |
|
| ../lib/Tie/File/t/10_splice_rs.t 438 |
unreported |
No result |
|
| ../lib/Tie/File/t/01_gen.t 439 |
unreported |
No result |
|
| ../lib/Tie/File/t/33_defer_vs.t 440 |
unreported |
No result |
|
| ../lib/Tie/File/t/29a_upcopy.t 441 |
unreported |
No result |
|
| ../lib/Tie/File/t/03_longfetch.t 442 |
unreported |
No result |
|
| ../lib/Tie/File/t/30_defer.t 443 |
unreported |
No result |
|
| ../lib/Tie/File/t/05_size.t 444 |
unreported |
No result |
|
| ../lib/Tie/File/t/00_version.t 445 |
unreported |
No result |
|
| ../lib/Tie/File/t/13_size_rs.t 446 |
unreported |
No result |
|
| ../lib/Tie/File/t/41_heap.t 447 |
unreported |
No result |
|
| ../lib/Tie/File/t/15_pushpop.t 448 |
unreported |
No result |
|
| ../lib/Unicode/Collate/t/cjkrange.t 477 |
failed |
|
|
| ../lib/Unicode/Collate/t/version.t 481 |
failed |
|
|
| ../lib/Unicode/Collate/t/override.t 482 |
failed |
|
|
| ../lib/Unicode/UCD.t 489 |
failed |
|
|
| ../lib/base/t/fields-base.t 492 |
failed |
|
|
| ../lib/Locale/Codes/t/rename.t 503 |
failed |
|
|
| ../lib/Locale/Codes/t/languages.t 504 |
failed |
|
|
| ../lib/Locale/Codes/t/script.t 506 |
failed |
|
|
| ../lib/Locale/Codes/t/all.t 507 |
failed |
|
|
| ../lib/Locale/Codes/t/uk.t 508 |
failed |
|
|
| ../lib/Locale/Codes/t/currency.t 509 |
failed |
|
|
| ../lib/Locale/Codes/t/country.t 510 |
failed |
|
|
| ../lib/DBM_Filter/t/encode.t 549 |
failed |
|
|
| ../lib/DBM_Filter/t/utf8.t 550 |
failed |
|
|
| ../lib/DBM_Filter/t/null.t 551 |
failed |
|
|
| ../lib/DBM_Filter/t/int32.t 552 |
failed |
|
|
| ../lib/constant.t 554 |
failed |
|
|
| ../lib/Net/Ping/t/120_udp_inst.t 560 |
unreported |
No result |
|
| ../lib/Net/Ping/t/110_icmp_inst.t 561 |
unreported |
No result |
|
| ../lib/Net/Ping/t/250_ping_hires.t 562 |
unreported |
No result |
|
| ../lib/Net/Ping/t/140_stream_inst.t 563 |
unreported |
No result |
|
| ../lib/Net/Ping/t/150_syn_inst.t 564 |
unreported |
No result |
|
| ../lib/Net/Ping/t/190_alarm.t 565 |
unreported |
No result |
|
| ../lib/Net/Ping/t/130_tcp_inst.t 566 |
unreported |
No result |
|
| ../lib/Net/Ping/t/400_ping_syn.t 567 |
unreported |
No result |
|
| ../lib/Net/Ping/t/410_syn_host.t 568 |
unreported |
No result |
|
| ../lib/Net/Ping/t/510_ping_udp.t 569 |
unreported |
No result |
|
| ../lib/Net/Ping/t/450_service.t 570 |
unreported |
No result |
|
| ../lib/Net/Ping/t/500_ping_icmp.t 571 |
unreported |
No result |
|
| ../lib/Net/Ping/t/100_load.t 572 |
failed |
|
|
| ../lib/Net/Ping/t/200_ping_tcp.t 573 |
unreported |
No result |
|
| ../lib/Pod/t/htmlescp.t 592 |
failed |
|
|
| ../lib/ExtUtils/t/Installed.t 611 |
failed |
|
|
| ../lib/ExtUtils/t/writemakefile_args.t 612 |
failed |
|
|
| ../lib/ExtUtils/t/basic.t 623 |
failed |
|
|
| ../lib/ExtUtils/t/Manifest.t 626 |
failed |
|
|
| ../lib/ExtUtils/t/MM_Unix.t 629 |
failed |
|
|
| ../lib/Time/Local.t 648 |
failed |
|
|
| ../ext/Devel/Peek/t/Peek.t 658 |
failed (waived) |
Test suite deficency |
|
| ../ext/Devel/PPPort/t/misc.t 659 |
failed |
|
|
| ../ext/Devel/PPPort/t/call.t 660 |
failed |
|
|
| ../ext/Devel/PPPort/t/mPUSH.t 661 |
failed |
|
|
| ../ext/Devel/PPPort/t/ppphtest.t 662 |
failed |
|
|
| ../ext/Devel/PPPort/t/exception.t 663 |
failed |
|
|
| ../ext/Devel/PPPort/t/newCONSTSUB.t 664 |
failed |
|
|
| ../ext/Devel/PPPort/t/uv.t 665 |
failed |
|
|
| ../ext/Devel/PPPort/t/cop.t 666 |
failed |
|
|
| ../ext/Devel/PPPort/t/newRV.t 667 |
failed |
|
|
| ../ext/Devel/PPPort/t/SvPV.t 668 |
failed |
|
|
| ../ext/Devel/PPPort/t/limits.t 669 |
failed |
|
|
| ../ext/Devel/PPPort/t/sv_xpvf.t 670 |
failed |
|
|
| ../ext/Devel/PPPort/t/magic.t 671 |
failed |
|
|
| ../ext/Devel/PPPort/t/MY_CXT.t 672 |
failed |
|
|
| ../ext/Devel/PPPort/t/grok.t 673 |
failed |
|
|
| ../ext/Devel/PPPort/t/threads.t 674 |
failed |
|
|
| ../ext/Sys/Syslog/t/syslog.t 686 |
failed (waived) |
Test suite deficiency |
|
| ../ext/Encode/t/perlio.t 693 |
failed |
|
|
| ../ext/Encode/t/enc_data.t 698 |
unreported |
No result |
|
| ../ext/Encode/t/enc_eucjp.t 700 |
unreported |
No result |
|
| ../ext/Encode/t/at-cn.t 701 |
failed |
|
|
| ../ext/Encode/t/at-tw.t 704 |
failed |
|
|
| ../ext/Encode/t/guess.t 705 |
failed |
|
|
| ../ext/Encode/t/enc_module.t 706 |
unreported |
No result |
|
| ../ext/Encode/t/Aliases.t 707 |
testsuite_error |
|
|
| ../ext/Encode/t/Aliases.t 707 |
failed |
|
Message from the test:
FAILED tests 3, 14, 17-18, 32, 35, 38, 44, 47, 49, 51, 56, 58, 61, 68, 73, 78, 81-82, 88, 90, 96, 104, 109, 119, 127, 131-132, 135, 143, 146-148, 152, 154-155, 159, 161, 165, 167, 176, 178, 193, 195, 199, 204, 207, 209, 219, 221-223, 227, 230, 241-243, 246, 261, 271, 281-283, 287, 290, 296, 313, 321, 324, 327-328, 331-332, 347, 352, 363, 366-367, 381, 384, 387, 393, 396, 398, 400, 405, 407, 410, 417, 422, 427, 430-431, 437, 439, 445, 453, 458, 468, 476, 480-481, 484, 492, 495-497, 501, 50
Open the journal:
/var/opt/lsb/test/manager/results/x86-comp-79a047.localdomain-2010-08-26-17h-35m-16s/results/perl.journal:5010/var/opt/lsb/test/manager/results/x86-comp-79a047.localdomain-2010-08-26-17h-35m-16s/results/perl.journal:5010
|
| ../ext/Encode/t/CJKT.t 708 |
failed |
|
|
| ../ext/Encode/t/jperl.t 709 |
failed |
|
|
| ../ext/Encode/t/gsm0338.t 711 |
failed |
|
|
| ../ext/B/t/concise-xs.t 752 |
failed (waived) |
Test suite deficency |
|
| ../ext/B/t/deparse.t 753 |
failed |
|
|
| ../ext/B/t/f_map.t 758 |
failed (waived) |
Test suite deficency |
|
| ../ext/B/t/f_sort.t 763 |
failed (waived) |
Test suite deficency |
|
| ../ext/B/t/optree_samples.t 765 |
failed |
|
|
| ../ext/List/Util/t/p_lln.t 766 |
failed |
|
|
| ../ext/List/Util/t/lln.t 772 |
failed |
|
|